Reaction Details
TargetBeta-lactamase
LigandBDBM26139
Substrate/Competitorn/a
Meas. Tech.ChEMBL_35527 (CHEMBL649553)
Ki 27±n/a nM
Citation Powers, RAShoichet, BK Structure-based approach for binding site identification on AmpC beta-lactamase. J Med Chem45:3222-34 (2002) Beta-lactamase
Name:Beta-lactamase
Type:Protien
Mol. Mass.:41561.62
Organism:Escherichia coli
Description:P00811
Residue:377
BDBM26139
NameBDBM26139
Synonyms:1-benzothiophen-2-ylboranediol CHEMBL34964 | Phenylboronic acid, 11
Typen/a
Emp. Form.C8H7BO2S
Mol. Mass.178.016
SMILESOB(O)c1cc2ccccc2s1