Reaction Details
TargetAngiotensin-converting enzyme
LigandBDBM50115837
Substrate/Competitorn/a
Meas. Tech.ChEBML_35382
Ki 3±n/a nM
Citation Inguimbert, NPoras, HTeffo, FBeslot, FSelkti, MTomas, AScalbert, EBennejean, CRenard, PFournié-Zaluski, MCRoques, BP N-[2-(Indan-1-yl)-3-mercapto-propionyl] amino acids as highly potent inhibitors of the three vasopeptidases (NEP, ACE, ECE): In vitro and In vivo activities. Bioorg Med Chem Lett12:2001-5 (2002) Angiotensin-converting enzyme
Name:Angiotensin-converting enzyme
Type:PROTEIN
Mol. Mass.:150907.81
Organism:Rattus norvegicus
Description:ChEMBL_35219
Residue:1313
BDBM50115837
NameBDBM50115837
Synonyms:2-[2-(5-Cyano-indan-1-yl)-3-mercapto-propionylamino]-3-(1H-indol-3-yl)-propionic acid | CHEMBL59674
TypeSmall organic molecule
Emp. Form.C24H23N3O3S
Mol. Mass.433.523
SMILESOC(=O)C(Cc1c[nH]c2ccccc12)NC(=O)C(CS)C1CCc2cc(ccc12)C#N