Reaction Details
TargetAngiotensin-converting enzyme
LigandBDBM50115848
Substrate/Competitorn/a
Meas. Tech.ChEBML_35382
Ki 30±n/a nM
Citation Inguimbert, NPoras, HTeffo, FBeslot, FSelkti, MTomas, AScalbert, EBennejean, CRenard, PFournié-Zaluski, MCRoques, BP N-[2-(Indan-1-yl)-3-mercapto-propionyl] amino acids as highly potent inhibitors of the three vasopeptidases (NEP, ACE, ECE): In vitro and In vivo activities. Bioorg Med Chem Lett12:2001-5 (2002) Angiotensin-converting enzyme
Name:Angiotensin-converting enzyme
Type:PROTEIN
Mol. Mass.:150907.81
Organism:Rattus norvegicus
Description:ChEMBL_35219
Residue:1313
BDBM50115848
NameBDBM50115848
Synonyms:(S)-3-(1H-Indol-3-yl)-2-[(R)-3-mercapto-2-((S)-5-methoxy-indan-1-yl)-propionylamino]-propionic acid | CHEMBL305388
TypeSmall organic molecule
Emp. Form.C24H26N2O4S
Mol. Mass.438.539
SMILESCOc1ccc2[C@@H](CCc2c1)[C@@H](CS)C(=O)N[C@@H](Cc1c[nH]c2ccccc12)C(O)=O