Reaction Details
TargetSubstance-K receptor
LigandBDBM50403920
Substrate/Competitorn/a
Meas. Tech.ChEBML_209019
IC50 43±n/a nM
Citation Mah, RGerspacher, Mvon Sprecher, AStutz, STschinke, VAnderson, GPBertrand, CSubramanian, NBall, HA Biphenyl derivatives as novel dual NK(1)/NK(2)-receptor antagonists. Bioorg Med Chem Lett12:2065-8 (2002) Substance-K receptor
Name:Substance-K receptor
Type:Protein
Mol. Mass.:44455.78
Organism:Homo sapiens (Human)
Description:P21452
Residue:398
BDBM50403920
NameBDBM50403920
Synonyms:CHEMBL2112212
TypeSmall organic molecule
Emp. Form.C29H23Cl2F6N3O3
Mol. Mass.646.408
SMILESCN(C(=O)c1cc(cc(c1)C(F)(F)F)C(F)(F)F)c1cc(ccc1-c1ccc(Cl)c(Cl)c1)C(=O)N[C@@H]1CCCCNC1=O