Reaction Details
TargetFolylpolyglutamate synthase, mitochondrial
LigandBDBM50116251
Substrate/Competitorn/a
Meas. Tech.ChEBML_68690
IC50 8600±n/a nM
Citation Tsukamoto, TFlanary, JMRojas, CSlusher, BSValiaeva, NCoward, JK Phosphonate and phosphinate analogues of N-acylated gamma-glutamylglutamate. potent inhibitors of glutamate carboxypeptidase II. Bioorg Med Chem Lett12:2189-92 (2002) Folylpolyglutamate synthase, mitochondrial
Name:Folylpolyglutamate synthase, mitochondrial
Type:PROTEIN
Mol. Mass.:64621.95
Organism:Homo sapiens (Human)
Description:ChEMBL_68676
Residue:587
BDBM50116251
NameBDBM50116251
Synonyms:2-{[3-(4-Amino-benzoylamino)-3-carboxy-propyl]-hydroxy-phosphinoyloxy}-pentanedioic acid | CHEMBL307085
TypeSmall organic molecule
Emp. Form.C16H21N2O10P
Mol. Mass.432.3191
SMILESNc1ccc(cc1)C(=O)N[C@@H](CCP(O)(=O)O[C@@H](CCC(O)=O)C(O)=O)C(O)=O