Reaction Details
TargetCaspase-3
LigandBDBM50116265
Substrate/Competitorn/a
Meas. Tech.ChEBML_46684
Ki 143±n/a nM
Citation Willoughby, CABull, HGGarcia-Calvo, MJiang, JChapman, KTThornberry, NA Discovery of potent, selective human granzyme B inhibitors that inhibit CTL mediated apoptosis. Bioorg Med Chem Lett12:2197-200 (2002) Caspase-3
Name:Caspase-3
Type:Hydrolase; heterotetramer of two heterodimers
Mol. Mass.:31607.55
Organism:Homo sapiens (Human)
Description:n/a
Residue:277
BDBM50116265
NameBDBM50116265
Synonyms:(S)-3-({(S)-(S)-5-[(S)-2-((S)-Acetyl-methyl-amino)-3-methyl-pentanoylamino]-4-oxo-1,2,4,5,6,7-hexahydro-azepino[3,2,1-hi]indole-2-carbonyl}-amino)-4-benzothiazol-2-yl-4-oxo-butyric acid | CHEMBL69027
TypeSmall organic molecule
Emp. Form.C33H37N5O7S
Mol. Mass.647.741
SMILESCC[C@H](C)[C@H](N(C)C(C)=O)C(=O)N[C@H]1CCc2cccc3C[C@H](N(c23)C1=O)C(=O)N[C@@H](CC(O)=O)C(=O)c1nc2ccccc2s1