Reaction Details
TargetCaspase-8
LigandBDBM50116260
Substrate/Competitorn/a
Meas. Tech.ChEBML_46870
Ki 350±n/a nM
Citation Willoughby, CABull, HGGarcia-Calvo, MJiang, JChapman, KTThornberry, NA Discovery of potent, selective human granzyme B inhibitors that inhibit CTL mediated apoptosis. Bioorg Med Chem Lett12:2197-200 (2002) Caspase-8
Name:Caspase-8
Type:Enzyme
Mol. Mass.:55373.89
Organism:Homo sapiens (Human)
Description:Q14790
Residue:479
BDBM50116260
NameBDBM50116260
Synonyms:(R)-2-({(2S,5S)-5-[(S)-2-(Acetyl-methyl-amino)-3-(S)-methyl-pentanoylamino]-4-oxo-1,2,4,5,6,7-hexahydro-azepino[3,2,1-hi]indole-2-carbonyl}-amino)-3-oxo-propionic acid | CHEMBL304368
TypeSmall organic molecule
Emp. Form.C25H32N4O7
Mol. Mass.500.5442
SMILESCC[C@H](C)[C@H](N(C)C(C)=O)C(=O)N[C@H]1CCc2cccc3C[C@H](N(c23)C1=O)C(=O)N[C@H](C=O)C(O)=O