Reaction Details
TargetPeptidyl-prolyl cis-trans isomerase FKBP1A
LigandBDBM50116632
Substrate/Competitorn/a
Meas. Tech.ChEMBL_66275 (CHEMBL678145)
Ki 6±n/a nM
Citation Hamilton, GSWu, YQLimburg, DCWilkinson, DEVaal, MJLi, JHThomas, CHuang, WSauer, HRoss, DTSoni, RChen, YGuo, HHoworth, PValentine, HLiang, SSpicer, DFuller, MSteiner, JP Synthesis of N-glyoxyl prolyl and pipecolyl amides and thioesters and evaluation of their in vitro and in vivo nerve regenerative effects. J Med Chem45:3549-57 (2002) Peptidyl-prolyl cis-trans isomerase FKBP1A
Name:Peptidyl-prolyl cis-trans isomerase FKBP1A
Type:Isomerase
Mol. Mass.:11953.09
Organism:Homo sapiens (Human)
Description:P62942
Residue:108
BDBM50116632
NameBDBM50116632
Synonyms:1-(3,3-Dimethyl-2-oxo-pentanoyl)-pyrrolidine-2-carbothioic acid S-(3-naphthalen-2-yl-propyl) ester | CHEMBL118937
TypeSmall organic molecule
Emp. Form.C25H31NO3S
Mol. Mass.425.584
SMILESCCC(C)(C)C(=O)C(=O)N1CCC[C@H]1C(=O)SCCCc1ccc2ccccc2c1