Reaction Details
TargetCannabinoid receptor 1
LigandBDBM50116862
Substrate/Competitorn/a
Meas. Tech.ChEBML_46449
Ki 5700±n/a nM
Citation Hynes, JLeftheris, KWu, HPandit, CChen, PNorris, DJChen, BCZhao, RKiener, PAChen, XTurk, LAPatil-Koota, VGillooly, KMShuster, DJMcIntyre, KW C-3 Amido-indole cannabinoid receptor modulators. Bioorg Med Chem Lett12:2399-402 (2002) Cannabinoid receptor 1
Name:Cannabinoid receptor 1
Type:G Protein-Coupled Receptor (GPCR)
Mol. Mass.:52868.96
Organism:Homo sapiens (Human)
Description:P21554
Residue:472
BDBM50116862
NameBDBM50116862
Synonyms:(S)-3-(4-Hydroxy-phenyl)-2-[(E)-3-(4-methoxy-3-pentyloxy-phenyl)-acryloylamino]-propionic acid methyl ester | CHEMBL309553
TypeSmall organic molecule
Emp. Form.C25H31NO6
Mol. Mass.441.5167
SMILESCCCCCOc1cc(\C=C\C(=O)N[C@@H](Cc2ccc(O)cc2)C(=O)OC)ccc1OC