Reaction Details
TargetIntegrin alpha-4/beta-1
LigandBDBM50117031
Substrate/Competitorn/a
Meas. Tech.ChEMBL_214378 (CHEMBL821110)
IC50 0.400000±n/a nM
Citation Sidduri, ATilley, JWHull, KLou, JPKaplan, GSheffron, AChen, LCampbell, RGuthrie, RHuang, TNHuby, NRowan, KSchwinge, VRenzetti, LM N-Cycloalkanoyl-L-phenylalanine derivatives as VCAM/VLA-4 antagonists. Bioorg Med Chem Lett12:2475-8 (2002) Integrin alpha-4/beta-1
Name:Integrin alpha-4/beta-1
Type:n/a
Mol. Mass.:n/a
Description:ASSAY_ID of EBI is 88912
Components:This complex has 2 components.
Component 1
Name:Integrin beta-1
Synonyms:CD_antigen=CD29 Fibronectin receptor beta GPIIA ITGB1 MDF2 | MSK12
Type:Enzyme
Mol. Mass.:88400.38
Organism:Homo sapiens (Human)
Description:P05556
Residue:798
Component 2
Name:Integrin alpha-4
Synonyms:CD49 antigen-like family member D CD49d antigen ITA4_HUMAN Integrin alpha-4 Integrin alpha-IV VLA-4 integrin alpha 4 precursor | integrin alpha-4 precursor
Type:Membrane Protein
Mol. Mass.:114897.35
Organism:Homo sapiens (Human)
Description:P13612
Residue:1032
BDBM50117031
NameBDBM50117031
Synonyms:(S)-3-[4-(2,6-Dichloro-benzoylamino)-phenyl]-2-({1-[3-(1-methyl-1H-tetrazol-5-yl)-benzyl]-cyclopentanecarbonyl}-amino)-propionic acid | CHEMBL311698
TypeSmall organic molecule
Emp. Form.C31H30Cl2N6O4
Mol. Mass.621.514
SMILESCn1nnnc1-c1cccc(CC2(CCCC2)C(=O)N[C@@H](Cc2ccc(NC(=O)c3c(Cl)cccc3Cl)cc2)C(O)=O)c1