Reaction Details
TargetMycothiol S-conjugate amidase
LigandBDBM50117080
Substrate/Competitorn/a
Meas. Tech.ChEBML_140808
IC50 2720000±n/a nM
Citation Nicholas, GMEckman, LLRay, SHughes, ROPfefferkorn, JABarluenga, SNicolaou, KCBewley, CA Bromotyrosine-derived natural and synthetic products as inhibitors of mycothiol-S-conjugate amidase. Bioorg Med Chem Lett12:2487-90 (2002) Mycothiol S-conjugate amidase
Name:Mycothiol S-conjugate amidase
Type:PROTEIN
Mol. Mass.:32719.79
Organism:Mycobacterium tuberculosis
Description:ChEMBL_626858
Residue:288
BDBM50117080
NameBDBM50117080
Synonyms:3-(3,5-Difluoro-phenyl)-N-[2-(4-fluoro-phenyldisulfanyl)-ethyl]-2-[(Z)-hydroxyimino]-propionamide CHEMBL314490
TypeSmall organic molecule
Emp. Form.C17H15F3N2O2S2
Mol. Mass.400.438
SMILESFc1ccc(SSCCNC(=O)C(Cc2cc(F)cc(F)c2)N=O)cc1