Reaction Details
TargetPlatelet-activating factor acetylhydrolase
LigandBDBM50117785
Substrate/Competitorn/a
Meas. Tech.ChEBML_156373
IC50 0.100000±n/a nM
Citation Blackie, JABloomer, JCBrown, MJCheng, HYElliott, RLHammond, BHickey, DMIfe, RJLeach, CALewis, VAMacphee, CHMilliner, KJMoores, KEPinto, ILSmith, SAStansfield, IGStanway, SJTaylor, MATheobald, CJWhittaker, CM The discovery of SB-435495. A potent, orally active inhibitor of lipoprotein-associated phospholipase A(2) for evaluation in man. Bioorg Med Chem Lett12:2603-6 (2002) Platelet-activating factor acetylhydrolase
Name:Platelet-activating factor acetylhydrolase
Type:PROTEIN
Mol. Mass.:50084.41
Organism:Homo sapiens (Human)
Description:ChEMBL_156212
Residue:441
BDBM50117785
NameBDBM50117785
Synonyms:2-[2-(4-Fluoro-benzylsulfanyl)-5-(1-methyl-1H-pyrazol-4-ylmethyl)-4-oxo-4H-pyrimidin-1-yl]-N-(2-morpholin-4-yl-2-oxo-ethyl)-N-(4'-trifluoromethyl-biphenyl-4-ylmethyl)-acetamide | CHEMBL89451
TypeSmall organic molecule
Emp. Form.C38H36F4N6O4S
Mol. Mass.748.789
SMILESCn1cc(Cc2cn(CC(=O)N(CC(=O)N3CCOCC3)Cc3ccc(cc3)-c3ccc(cc3)C(F)(F)F)c(SCc3ccc(F)cc3)nc2=O)cn1