Reaction Details
TargetPlatelet-activating factor acetylhydrolase
LigandBDBM50117780
Substrate/Competitorn/a
Meas. Tech.ChEBML_156373
IC50 0.200000±n/a nM
Citation Blackie, JABloomer, JCBrown, MJCheng, HYElliott, RLHammond, BHickey, DMIfe, RJLeach, CALewis, VAMacphee, CHMilliner, KJMoores, KEPinto, ILSmith, SAStansfield, IGStanway, SJTaylor, MATheobald, CJWhittaker, CM The discovery of SB-435495. A potent, orally active inhibitor of lipoprotein-associated phospholipase A(2) for evaluation in man. Bioorg Med Chem Lett12:2603-6 (2002) Platelet-activating factor acetylhydrolase
Name:Platelet-activating factor acetylhydrolase
Type:PROTEIN
Mol. Mass.:50084.41
Organism:Homo sapiens (Human)
Description:ChEMBL_156212
Residue:441
BDBM50117780
NameBDBM50117780
Synonyms:CHEMBL85080 | N-(4'-Chloro-biphenyl-4-ylmethyl)-N-dimethylcarbamoylmethyl-2-[2-(4-fluoro-benzylsulfanyl)-5-(1-methyl-1H-pyrazol-4-ylmethyl)-4-oxo-4H-pyrimidin-1-yl]-acetamide
TypeSmall organic molecule
Emp. Form.C35H34ClFN6O3S
Mol. Mass.673.199
SMILESCN(C)C(=O)CN(Cc1ccc(cc1)-c1ccc(Cl)cc1)C(=O)Cn1cc(Cc2cnn(C)c2)c(=O)nc1SCc1ccc(F)cc1