Reaction Details
TargetPlatelet-activating factor acetylhydrolase
LigandBDBM50107496
Substrate/Competitorn/a
Meas. Tech.ChEBML_156373
IC50 1±n/a nM
Citation Blackie, JABloomer, JCBrown, MJCheng, HYElliott, RLHammond, BHickey, DMIfe, RJLeach, CALewis, VAMacphee, CHMilliner, KJMoores, KEPinto, ILSmith, SAStansfield, IGStanway, SJTaylor, MATheobald, CJWhittaker, CM The discovery of SB-435495. A potent, orally active inhibitor of lipoprotein-associated phospholipase A(2) for evaluation in man. Bioorg Med Chem Lett12:2603-6 (2002) Platelet-activating factor acetylhydrolase
Name:Platelet-activating factor acetylhydrolase
Type:PROTEIN
Mol. Mass.:50084.41
Organism:Homo sapiens (Human)
Description:ChEMBL_156212
Residue:441
BDBM50107496
NameBDBM50107496
Synonyms:CHEMBL328023 | N-(4'-Chloro-biphenyl-4-ylmethyl)-2-[2-(4-fluoro-benzylsulfanyl)-5-(1-methyl-1H-pyrazol-4-ylmethyl)-4-oxo-4H-pyrimidin-1-yl]-N-methyl-acetamide
TypeSmall organic molecule
Emp. Form.C32H29ClFN5O2S
Mol. Mass.602.121
SMILESCN(Cc1ccc(cc1)-c1ccc(Cl)cc1)C(=O)Cn1cc(Cc2cnn(C)c2)c(=O)nc1SCc1ccc(F)cc1