Reaction Details
TargetFructose-1,6-bisphosphatase 1
LigandBDBM50117955
Substrate/Competitorn/a
Meas. Tech.ChEMBL_69130 (CHEMBL681254)
IC50 520±n/a nM
Citation Wright, SWCarlo, AACarty, MDDanley, DEHageman, DLKaram, GALevy, CBMansour, MNMathiowetz, AMMcClure, LDNestor, NBMcPherson, RKPandit, JPustilnik, LRSchulte, GKSoeller, WCTreadway, JLWang, IKBauer, PH Anilinoquinazoline inhibitors of fructose 1,6-bisphosphatase bind at a novel allosteric site: synthesis, in vitro characterization, and X-ray crystallography. J Med Chem45:3865-77 (2002) Fructose-1,6-bisphosphatase 1
Name:Fructose-1,6-bisphosphatase 1
Type:PROTEIN
Mol. Mass.:39605.40
Organism:Rattus norvegicus
Description:ChEMBL_595158
Residue:363
BDBM50117955
NameBDBM50117955
Synonyms:4-[3-(6,7-Diethoxy-quinazolin-4-ylamino)-phenyl]-thiazole-2-carboxylic acid amide | CHEMBL419776
TypeSmall organic molecule
Emp. Form.C22H21N5O3S
Mol. Mass.435.499
SMILESCCOc1cc2ncnc(Nc3cccc(c3)-c3csc(n3)C(N)=O)c2cc1OCC