Reaction Details
TargetEpidermal growth factor receptor
LigandBDBM50117983
Substrate/Competitorn/a
Meas. Tech.ChEMBL_67206 (CHEMBL678292)
IC50 11±n/a nM
Citation Wright, SWCarlo, AACarty, MDDanley, DEHageman, DLKaram, GALevy, CBMansour, MNMathiowetz, AMMcClure, LDNestor, NBMcPherson, RKPandit, JPustilnik, LRSchulte, GKSoeller, WCTreadway, JLWang, IKBauer, PH Anilinoquinazoline inhibitors of fructose 1,6-bisphosphatase bind at a novel allosteric site: synthesis, in vitro characterization, and X-ray crystallography. J Med Chem45:3865-77 (2002) Epidermal growth factor receptor
Name:Epidermal growth factor receptor
Type:Receptor Kinase Domain
Mol. Mass.:134279.59
Organism:Homo sapiens (Human)
Description:P00533
Residue:1210
BDBM50117983
NameBDBM50117983
Synonyms:(6,7-Diethoxy-quinazolin-4-yl)-(3-thiazol-5-yl-phenyl)-amine | CHEMBL340862
TypeSmall organic molecule
Emp. Form.C21H20N4O2S
Mol. Mass.392.474
SMILESCCOc1cc2ncnc(Nc3cccc(c3)-c3cncs3)c2cc1OCC