Reaction Details
TargetThyroid hormone receptor beta
LigandBDBM50133531
Substrate/Competitorn/a
Meas. Tech.ChEMBL_2058576 (CHEMBL4713577)
Kd 590±n/a nM
Citation Sandner, ANgo, KSchiebel, JPizarroso, AIMSchmidt, LWenzel, BSteinmetzer, TOstermann, AHeine, AKlebe, G How a Fragment Draws Attention to Selectivity Discriminating Features between the Related Proteases Trypsin and Thrombin. J Med Chem64:1611-1625 (2021) 
 
Thyroid hormone receptor beta
Name:Thyroid hormone receptor beta
Type:Receptor
Mol. Mass.:52793.62
Organism:Homo sapiens (Human)
Description:Recombinant hThR was obtained from nuclear extracts from SF9 cells infected with baculovirus vectors encoding for ThRbeta 1.
Residue:461
BDBM50133531
NameBDBM50133531
Synonyms:(S)-1-((R)-2-Amino-3-phenyl-propionyl)-pyrrolidine-2-carboxylic acid 3-chloro-benzylamide CHEMBL321130 | D-phenylalanyl-N-(3-chlorobenzyl)-L-prolinamide
TypeSmall organic molecule
Emp. Form.C21H24ClN3O2
Mol. Mass.385.887
SMILESN[C@H](Cc1ccccc1)C(=O)N1CCC[C@H]1C(=O)NCc1cccc(Cl)c1