Reaction Details
TargetMatrix metalloproteinase-9
LigandBDBM50118975
Substrate/Competitorn/a
Meas. Tech.ChEBML_105515
IC50 1±n/a nM
Citation Nelson, FCDelos Santos, ELevin, JIChen, JMSkotnicki, JSDiJoseph, JFSharr, MASung, AKillar, LMCowling, RJin, GRoth, CEAlbright, JD Benzodiazepine inhibitors of the MMPs and TACE. Bioorg Med Chem Lett12:2867-70 (2002) Matrix metalloproteinase-9
Name:Matrix metalloproteinase-9
Type:Enzyme
Mol. Mass.:78452.28
Organism:Homo sapiens (Human)
Description:P14780
Residue:707
BDBM50118975
NameBDBM50118975
Synonyms:4-(4-Methoxy-benzenesulfonyl)-1-(thiophene-2-carbonyl)-2,3,4,5-tetrahydro-1H-benzo[e][1,4]diazepine-3-carboxylic acid hydroxyamide | CHEMBL95807
TypeSmall organic molecule
Emp. Form.C22H21N3O6S2
Mol. Mass.487.549
SMILESCOc1ccc(cc1)S(=O)(=O)N1Cc2ccccc2N(CC1C(=O)NO)C(=O)c1cccs1