Reaction Details
TargetCollagenase 3
LigandBDBM50118974
Substrate/Competitorn/a
Meas. Tech.ChEBML_106631
IC50 1±n/a nM
Citation Nelson, FCDelos Santos, ELevin, JIChen, JMSkotnicki, JSDiJoseph, JFSharr, MASung, AKillar, LMCowling, RJin, GRoth, CEAlbright, JD Benzodiazepine inhibitors of the MMPs and TACE. Bioorg Med Chem Lett12:2867-70 (2002) Collagenase 3
Name:Collagenase 3
Type:Enzyme
Mol. Mass.:53808.06
Organism:Homo sapiens (Human)
Description:P45452
Residue:471
BDBM50118974
NameBDBM50118974
Synonyms:1-Acetyl-4-(4-methoxy-benzenesulfonyl)-2,3,4,5-tetrahydro-1H-benzo[e][1,4]diazepine-3-carboxylic acid hydroxyamide | CHEMBL99072
TypeSmall organic molecule
Emp. Form.C19H21N3O6S
Mol. Mass.419.452
SMILESCOc1ccc(cc1)S(=O)(=O)N1Cc2ccccc2N(CC1C(=O)NO)C(C)=O