Reaction Details
TargetBeta-2 adrenergic receptor
LigandBDBM50119183
Substrate/Competitorn/a
Meas. Tech.ChEMBL_38617 (CHEMBL650883)
IC50 4±n/a nM
Citation Steffan, RJAshwell, MASolvibile, WRMatelan, ELargis, EHan, STillet, JMulvey, R Novel substituted 4-aminomethylpiperidines as potent and selective human beta3-agonists. Part 1: aryloxypropanolaminomethylpiperidines. Bioorg Med Chem Lett12:2957-61 (2002) Beta-2 adrenergic receptor
Name:Beta-2 adrenergic receptor
Type:n/a
Mol. Mass.:46461.69
Organism:Homo sapiens (Human)
Description:P07550
Residue:413
BDBM50119183
NameBDBM50119183
Synonyms:1-[4-(4-{[(S)-2-Hydroxy-3-(4-hydroxy-phenoxy)-propylamino]-methyl}-piperidine-1-sulfonyl)-phenyl]-3-octyl-urea | CHEMBL102194
TypeSmall organic molecule
Emp. Form.C30H46N4O6S
Mol. Mass.590.774
SMILESCCCCCCCCNC(=O)Nc1ccc(cc1)S(=O)(=O)N1CCC(CNC[C@H](O)COc2ccc(O)cc2)CC1