Reaction Details
TargetDihydroorotate dehydrogenase (quinone), mitochondrial
LigandBDBM50119482
Substrate/Competitorn/a
Meas. Tech.ChEMBL_52891 (CHEMBL872485)
Ki>50000±n/a nM
Citation Haque, TSTadesse, SMarcinkeviciene, JRogers, MJSizemore, CKopcho, LMAmsler, KEcret, LDZhan, DLHobbs, FSlee, ATrainor, GLStern, AMCopeland, RACombs, AP Parallel synthesis of potent, pyrazole-based inhibitors of Helicobacter pylori dihydroorotate dehydrogenase. J Med Chem45:4669-78 (2002) Dihydroorotate dehydrogenase (quinone), mitochondrial
Name:Dihydroorotate dehydrogenase (quinone), mitochondrial
Type:Enzyme
Mol. Mass.:42881.33
Organism:Homo sapiens (Human)
Description:Q02127
Residue:395
BDBM50119482
NameBDBM50119482
Synonyms:1-(4-Methoxy-phenyl)-1H-pyrazole-3,5-dicarboxylic acid 5-benzylamide 3-{[4-(pyrrolidine-1-carbonyl)-phenyl]-amide} | CHEMBL141338
TypeSmall organic molecule
Emp. Form.C30H29N5O4
Mol. Mass.523.5824
SMILESCOc1ccc(cc1)-n1nc(cc1C(=O)NCc1ccccc1)C(=O)Nc1ccc(cc1)C(=O)N1CCCC1