Reaction Details
TargetDihydroorotate dehydrogenase (quinone), mitochondrial
LigandBDBM50119491
Substrate/Competitorn/a
Meas. Tech.ChEMBL_52885 (CHEMBL665409)
Ki 138±n/a nM
Citation Haque, TSTadesse, SMarcinkeviciene, JRogers, MJSizemore, CKopcho, LMAmsler, KEcret, LDZhan, DLHobbs, FSlee, ATrainor, GLStern, AMCopeland, RACombs, AP Parallel synthesis of potent, pyrazole-based inhibitors of Helicobacter pylori dihydroorotate dehydrogenase. J Med Chem45:4669-78 (2002) Dihydroorotate dehydrogenase (quinone), mitochondrial
Name:Dihydroorotate dehydrogenase (quinone), mitochondrial
Type:Enzyme
Mol. Mass.:42881.33
Organism:Homo sapiens (Human)
Description:Q02127
Residue:395
BDBM50119491
NameBDBM50119491
Synonyms:1-(4-Methoxy-phenyl)-1H-pyrazole-3,5-dicarboxylic acid 3-(isobutyl-amide) 5-{[4-(pyrrolidine-1-carbonyl)-phenyl]-amide} | CHEMBL143345
TypeSmall organic molecule
Emp. Form.C27H31N5O4
Mol. Mass.489.5661
SMILESCOc1ccc(cc1)-n1nc(cc1C(=O)Nc1ccc(cc1)C(=O)N1CCCC1)C(=O)NCC(C)C