Reaction Details
TargetC-C chemokine receptor type 5
LigandBDBM50120316
Substrate/Competitorn/a
Meas. Tech.ChEBML_49844
Ki 5100±n/a nM
Citation Hegde, VRChan, TMPu, HGullo, VPPatel, MGDas, PWagner, NParameswaran, PSNaik, CG Two selective novel triterpene glycosides from sea cucumber, Telenata Ananas: inhibitors of chemokine receptor-5. Bioorg Med Chem Lett12:3203-5 (2002) C-C chemokine receptor type 5
Name:C-C chemokine receptor type 5
Type:Enzyme
Mol. Mass.:40540.21
Organism:Homo sapiens (Human)
Description:P51681
Residue:352
BDBM50120316
NameBDBM50120316
Synonyms:CHEMBL2367887 | Triterpene Glycoside analogue
TypeSmall organic molecule
Emp. Form.C67H110O32
Mol. Mass.1427.5711
SMILESCO[C@H]1[C@H](O)[C@@H](CO)OC(O[C@H]2[C@H](O)[C@@H](CO)O[C@@H](O[C@@H]3CO[C@@H](O[C@H]4CC[C@@]5(C)C(CCC6C5=C[C@H](O)C57C(CC[C@@]65C)[C@](C)(CCCC(C)C)OC7=O)C4(C)C)[C@H](O[C@@H]4O[C@H](C)[C@@H](O[C@@H]5O[C@H](CO)[C@@H](O)C(OC6O[C@H](CO)[C@@H](O)C(OC)[C@H]6O)[C@H]5O)[C@H](O)[C@H]4O)[C@H]3O)[C@@H]2O)[C@@H]1O