Reaction Details
TargetMetabotropic glutamate receptor 2
LigandBDBM50558768
Substrate/Competitorn/a
Meas. Tech.ChEMBL_2064694 (CHEMBL4719947)
Ki 5.2±n/a nM
Citation Chappell, MDLi, RSmith, SCDressman, BATromiczak, EGTripp, AEBlanco, MJVetman, TQuimby, SJMatt, JBritton, TCFivush, AMSchkeryantz, JMMayhugh, DErickson, JABures, MGJaramillo, CCarpintero, MDiego, JEBarberis, MGarcia-Cerrada, SSoriano, JFAntonysamy, SAtwell, SMacEwan, ICondon, BSougias, CWang, JZhang, AConners, KGroshong, CWasserman, SRKoss, JWWitkin, JMLi, XOvershiner, CWafford, KASeidel, WWang, XSHeinz, BASwanson, SCatlow, JTBedwell, DWMonn, JAMitch, CHOrnstein, PL Discovery of (1S,2R,3S,4S,5R,6R)-2-Amino-3-[(3,4-difluorophenyl)sulfanylmethyl]-4-hydroxy-bicyclo[3.1.0]hexane-2,6-dicarboxylic Acid Hydrochloride (LY3020371·HCl): A Potent, Metabotropic Glutamate 2/3 Receptor Antagonist with Antidepressant-Like Activity. J Med Chem59:10974-10993 (2016) Metabotropic glutamate receptor 2
Name:Metabotropic glutamate receptor 2
Type:Enzyme
Mol. Mass.:95584.88
Organism:Homo sapiens (Human)
Description:Q14416
Residue:872
BDBM50558768
NameBDBM50558768
Synonyms:CHEMBL4759992
TypeSmall organic molecule
Emp. Form.C18H20ClFN4O4S2
Mol. Mass.474.957
SMILESCl.[H][C@]12[C@H](C(O)=O)[C@@]1([H])[C@@](N)([C@H](CSc1ccc(F)c(C)c1)[C@H]2Sc1nc[nH]n1)C(O)=O