Reaction Details
TargetMetabotropic glutamate receptor 3
LigandBDBM50062522
Substrate/Competitorn/a
Meas. Tech.ChEMBL_2064695 (CHEMBL4719948)
Ki 1.3±n/a nM
Citation Chappell, MDLi, RSmith, SCDressman, BATromiczak, EGTripp, AEBlanco, MJVetman, TQuimby, SJMatt, JBritton, TCFivush, AMSchkeryantz, JMMayhugh, DErickson, JABures, MGJaramillo, CCarpintero, MDiego, JEBarberis, MGarcia-Cerrada, SSoriano, JFAntonysamy, SAtwell, SMacEwan, ICondon, BSougias, CWang, JZhang, AConners, KGroshong, CWasserman, SRKoss, JWWitkin, JMLi, XOvershiner, CWafford, KASeidel, WWang, XSHeinz, BASwanson, SCatlow, JTBedwell, DWMonn, JAMitch, CHOrnstein, PL Discovery of (1S,2R,3S,4S,5R,6R)-2-Amino-3-[(3,4-difluorophenyl)sulfanylmethyl]-4-hydroxy-bicyclo[3.1.0]hexane-2,6-dicarboxylic Acid Hydrochloride (LY3020371·HCl): A Potent, Metabotropic Glutamate 2/3 Receptor Antagonist with Antidepressant-Like Activity. J Med Chem59:10974-10993 (2016) Metabotropic glutamate receptor 3
Name:Metabotropic glutamate receptor 3
Type:Enzyme Catalytic Domain
Mol. Mass.:98889.09
Organism:Homo sapiens (Human)
Description:metabotropic glutamate 1c 0 HUMAN::Q14832
Residue:879
BDBM50062522
NameBDBM50062522
Synonyms:(1S,2S)-2-((S)-1-amino-1-carboxy-2-(9H-xanthen-9-yl)ethyl)cyclopropanecarboxylic acid (1S,2S)-2-[(S)-1-Amino-1-carboxy-2-(9H-xanthen-9-yl)-ethyl]-cyclopropanecarboxylic acid (S)-2-[(S)-1-Amino-1-carboxy-2-(9H-xanthen-9-yl)-ethyl]-cyclopropanecarboxylic acid 2-[1-Amino-1-carboxy-2-(9H-xanthen-9-yl)-ethyl]-cyclopropanecarboxylic acid(LY341495) | CHEMBL432038
TypeSmall organic molecule
Emp. Form.C20H19NO5
Mol. Mass.353.3686
SMILESN[C@@](CC1c2ccccc2Oc2ccccc12)([C@H]1C[C@@H]1C(O)=O)C(O)=O