Reaction Details
TargetGonadotropin-releasing hormone receptor
LigandBDBM50121085
Substrate/Competitorn/a
Meas. Tech.ChEBML_71598
Ki 51±n/a nM
Citation Luthin, DRHong, YPathak, VPPaderes, GNared-Hood, KDCastro, MAVazir, HLi, HTompkins, EChristie, LMay, JMAnderson, MB The discovery of novel small molecule non-peptide gonadotropin releasing hormone (GnRH) receptor antagonists. Bioorg Med Chem Lett12:3467-70 (2002) Gonadotropin-releasing hormone receptor
Name:Gonadotropin-releasing hormone receptor
Type:Enzyme
Mol. Mass.:37749.45
Organism:Homo sapiens (Human)
Description:P30968
Residue:328
BDBM50121085
NameBDBM50121085
Synonyms:4-({[5-(3,5,5,8,8-Pentamethyl-5,6,7,8-tetrahydro-naphthalen-2-ylmethyl)-furan-2-carbonyl]-amino}-methyl)-cyclohexanecarboxylic acid ethyl ester | CHEMBL325843
TypeSmall organic molecule
Emp. Form.C31H43NO4
Mol. Mass.493.6774
SMILESCCOC(=O)[C@H]1CC[C@H](CNC(=O)c2ccc(Cc3cc4c(cc3C)C(C)(C)CCC4(C)C)o2)CC1