Reaction Details
TargetReverse transcriptase/RNaseH
LigandBDBM50121357
Substrate/Competitorn/a
Meas. Tech.ChEMBL_195204 (CHEMBL798996)
IC50 4120±n/a nM
Citation Barreca, MLBalzarini, JChimirri, ADe Clercq, EDe Luca, LHöltje, HDHöltje, MMonforte, AMMonforte, PPannecouque, CRao, AZappalà, M Design, synthesis, structure-activity relationships, and molecular modeling studies of 2,3-diaryl-1,3-thiazolidin-4-ones as potent anti-HIV agents. J Med Chem45:5410-3 (2002) Reverse transcriptase/RNaseH
Name:Reverse transcriptase/RNaseH
Type:PROTEIN
Mol. Mass.:65229.15
Organism:Human immunodeficiency virus 1
Description:ChEMBL_1473730
Residue:566
BDBM50121357
NameBDBM50121357
Synonyms:2-(2,6-Difluoro-phenyl)-3-(4,6-dimethyl-pyridin-2-yl)-thiazolidin-4-one 2-(2,6-difluorophenyl)-3-(4,6-dimethylpyridin-2-yl)thiazolidin-4-one | CHEMBL150025
TypeSmall organic molecule
Emp. Form.C16H14F2N2OS
Mol. Mass.320.357
SMILESCc1cc(C)nc(c1)N1C(SCC1=O)c1c(F)cccc1F