Reaction Details
TargetReverse transcriptase/RNaseH
LigandBDBM50121347
Substrate/Competitorn/a
Meas. Tech.ChEMBL_195204 (CHEMBL798996)
IC50 14600±n/a nM
Citation Barreca, MLBalzarini, JChimirri, ADe Clercq, EDe Luca, LHöltje, HDHöltje, MMonforte, AMMonforte, PPannecouque, CRao, AZappalà, M Design, synthesis, structure-activity relationships, and molecular modeling studies of 2,3-diaryl-1,3-thiazolidin-4-ones as potent anti-HIV agents. J Med Chem45:5410-3 (2002) Reverse transcriptase/RNaseH
Name:Reverse transcriptase/RNaseH
Type:PROTEIN
Mol. Mass.:65229.15
Organism:Human immunodeficiency virus 1
Description:ChEMBL_1473730
Residue:566
BDBM50121347
NameBDBM50121347
Synonyms:CHEMBL625 | THIABENDAZOLE
TypeSmall organic molecule
Emp. Form.C10H7N3S
Mol. Mass.201.248
SMILESc1nc(cs1)-c1nc2ccccc2[nH]1