Reaction Details
TargetGonadotropin-releasing hormone receptor
LigandBDBM50121462
Substrate/Competitorn/a
Meas. Tech.ChEBML_71752
Ki 7±n/a nM
Citation Luthin, DRHong, YTompkins, EAnderes, KLPaderes, GKraynov, EACastro, MANared-Hood, KDCastillo, RGregory, MVazir, HMay, JMAnderson, MB Characterization of mono- and diaminopyrimidine derivatives as novel, nonpeptide gonadotropin releasing hormone (GnRH) receptor antagonists. Bioorg Med Chem Lett12:3635-9 (2002) Gonadotropin-releasing hormone receptor
Name:Gonadotropin-releasing hormone receptor
Type:PROTEIN
Mol. Mass.:37767.60
Organism:Rattus norvegicus
Description:ChEMBL_1335047
Residue:327
BDBM50121462
NameBDBM50121462
Synonyms:5-(3,5,5,8,8-Pentamethyl-5,6,7,8-tetrahydro-naphthalen-2-ylmethyl)-furan-2-carboxylic acid 3-({5-methyl-4-[(tetrahydro-furan-2-ylmethyl)-amino]-pyrimidin-2-ylamino}-methyl)-benzylamide | CHEMBL333574
TypeSmall organic molecule
Emp. Form.C39H49N5O3
Mol. Mass.635.8381
SMILESCc1cnc(NCc2cccc(CNC(=O)c3ccc(Cc4cc5c(cc4C)C(C)(C)CCC5(C)C)o3)c2)nc1NCC1CCCO1