Reaction Details
TargetGonadotropin-releasing hormone receptor
LigandBDBM50121473
Substrate/Competitorn/a
Meas. Tech.ChEBML_71600
Ki 110±n/a nM
Citation Luthin, DRHong, YTompkins, EAnderes, KLPaderes, GKraynov, EACastro, MANared-Hood, KDCastillo, RGregory, MVazir, HMay, JMAnderson, MB Characterization of mono- and diaminopyrimidine derivatives as novel, nonpeptide gonadotropin releasing hormone (GnRH) receptor antagonists. Bioorg Med Chem Lett12:3635-9 (2002) Gonadotropin-releasing hormone receptor
Name:Gonadotropin-releasing hormone receptor
Type:Enzyme
Mol. Mass.:37749.45
Organism:Homo sapiens (Human)
Description:P30968
Residue:328
BDBM50121473
NameBDBM50121473
Synonyms:5-(3,5,5,8,8-Pentamethyl-5,6,7,8-tetrahydro-naphthalen-2-ylmethyl)-furan-2-carboxylic acid 4-(pyrimidin-2-ylaminomethyl)-benzylamide | CHEMBL123301
TypeSmall organic molecule
Emp. Form.C33H38N4O2
Mol. Mass.522.6804
SMILESCc1cc2c(cc1Cc1ccc(o1)C(=O)NCc1ccc(CNc3ncccn3)cc1)C(C)(C)CCC2(C)C