Reaction Details
TargetGonadotropin-releasing hormone receptor
LigandBDBM50121479
Substrate/Competitorn/a
Meas. Tech.ChEBML_71752
Ki 26±n/a nM
Citation Luthin, DRHong, YTompkins, EAnderes, KLPaderes, GKraynov, EACastro, MANared-Hood, KDCastillo, RGregory, MVazir, HMay, JMAnderson, MB Characterization of mono- and diaminopyrimidine derivatives as novel, nonpeptide gonadotropin releasing hormone (GnRH) receptor antagonists. Bioorg Med Chem Lett12:3635-9 (2002) Gonadotropin-releasing hormone receptor
Name:Gonadotropin-releasing hormone receptor
Type:PROTEIN
Mol. Mass.:37767.60
Organism:Rattus norvegicus
Description:ChEMBL_1335047
Residue:327
BDBM50121479
NameBDBM50121479
Synonyms:5-(3,5,5,8,8-Pentamethyl-5,6,7,8-tetrahydro-naphthalen-2-ylmethyl)-furan-2-carboxylic acid [3-({4-[(tetrahydro-furan-2-ylmethyl)-amino]-pyrimidin-2-ylamino}-methyl)-cyclohexylmethyl]-amide | CHEMBL120420
TypeSmall organic molecule
Emp. Form.C38H53N5O3
Mol. Mass.627.8591
SMILESCc1cc2c(cc1Cc1ccc(o1)C(=O)NCC1CCC(CNc3nccc(NCC4CCCO4)n3)CC1)C(C)(C)CCC2(C)C