Reaction Details
TargetEstrogen receptor
LigandBDBM50121606
Substrate/Competitorn/a
Meas. Tech.ChEMBL_67518 (CHEMBL682301)
Ki 1380±n/a nM
Citation Henke, BRConsler, TGGo, NHale, RLHohman, DRJones, SALu, ATMoore, LBMoore, JTOrband-Miller, LARobinett, RGShearin, JSpearing, PKStewart, ELTurnbull, PSWeaver, SLWilliams, SPWisely, GBLambert, MH A new series of estrogen receptor modulators that display selectivity for estrogen receptor beta. J Med Chem45:5492-505 (2002) Estrogen receptor
Name:Estrogen receptor
Type:Protein
Mol. Mass.:66230.44
Organism:Homo sapiens (Human)
Description:P03372
Residue:595
BDBM50121606
NameBDBM50121606
Synonyms:4-{2-[4-(3-Phenyl-propylamino)-6-piperazin-1-yl-[1,3,5]triazin-2-ylamino]-ethyl}-phenol | CHEMBL150704
TypeSmall organic molecule
Emp. Form.C24H31N7O
Mol. Mass.433.5492
SMILESOc1ccc(CCNc2nc(NCCCc3ccccc3)nc(n2)N2CCNCC2)cc1