Reaction Details
TargetEstrogen receptor beta
LigandBDBM50121620
Substrate/Competitorn/a
Meas. Tech.ChEMBL_67203 (CHEMBL838887)
Ki 90±n/a nM
Citation Henke, BRConsler, TGGo, NHale, RLHohman, DRJones, SALu, ATMoore, LBMoore, JTOrband-Miller, LARobinett, RGShearin, JSpearing, PKStewart, ELTurnbull, PSWeaver, SLWilliams, SPWisely, GBLambert, MH A new series of estrogen receptor modulators that display selectivity for estrogen receptor beta. J Med Chem45:5492-505 (2002) Estrogen receptor beta
Name:Estrogen receptor beta
Type:Protein
Mol. Mass.:59238.43
Organism:Homo sapiens (Human)
Description:Q92731
Residue:530
BDBM50121620
NameBDBM50121620
Synonyms:4-[3-({4-[2-(4-Hydroxy-phenyl)-ethylamino]-6-piperazin-1-yl-[1,3,5]triazin-2-yl}-methyl-amino)-propyl]-benzonitrile | CHEMBL153359
TypeSmall organic molecule
Emp. Form.C26H32N8O
Mol. Mass.472.5853
SMILESCN(CCCc1ccc(cc1)C#N)c1nc(NCCc2ccc(O)cc2)nc(n1)N1CCNCC1