Reaction Details
TargetEstrogen receptor beta
LigandBDBM50121632
Substrate/Competitorn/a
Meas. Tech.ChEMBL_67203 (CHEMBL838887)
Ki 100±n/a nM
Citation Henke, BRConsler, TGGo, NHale, RLHohman, DRJones, SALu, ATMoore, LBMoore, JTOrband-Miller, LARobinett, RGShearin, JSpearing, PKStewart, ELTurnbull, PSWeaver, SLWilliams, SPWisely, GBLambert, MH A new series of estrogen receptor modulators that display selectivity for estrogen receptor beta. J Med Chem45:5492-505 (2002) Estrogen receptor beta
Name:Estrogen receptor beta
Type:Protein
Mol. Mass.:59238.43
Organism:Homo sapiens (Human)
Description:Q92731
Residue:530
BDBM50121632
NameBDBM50121632
Synonyms:1-(4-{4-{[3-(4-Chloro-phenyl)-propyl]-methyl-amino}-6-[2-(4-hydroxy-phenyl)-ethylamino]-[1,3,5]triazin-2-yl}-piperazin-1-yl)-2-phenoxy-ethanone | CHEMBL348343
TypeSmall organic molecule
Emp. Form.C33H38ClN7O3
Mol. Mass.616.153
SMILESCN(CCCc1ccc(Cl)cc1)c1nc(NCCc2ccc(O)cc2)nc(n1)N1CCN(CC1)C(=O)COc1ccccc1