Reaction Details
TargetEstrogen receptor beta
LigandBDBM50121633
Substrate/Competitorn/a
Meas. Tech.ChEMBL_67203 (CHEMBL838887)
Ki 40±n/a nM
Citation Henke, BRConsler, TGGo, NHale, RLHohman, DRJones, SALu, ATMoore, LBMoore, JTOrband-Miller, LARobinett, RGShearin, JSpearing, PKStewart, ELTurnbull, PSWeaver, SLWilliams, SPWisely, GBLambert, MH A new series of estrogen receptor modulators that display selectivity for estrogen receptor beta. J Med Chem45:5492-505 (2002) Estrogen receptor beta
Name:Estrogen receptor beta
Type:Protein
Mol. Mass.:59238.43
Organism:Homo sapiens (Human)
Description:Q92731
Residue:530
BDBM50121633
NameBDBM50121633
Synonyms:4-[2-(4-{[3-(2-Chloro-phenyl)-propyl]-methyl-amino}-6-piperazin-1-yl-[1,3,5]triazin-2-ylamino)-ethyl]-phenol | CHEMBL346215
TypeSmall organic molecule
Emp. Form.C25H32ClN7O
Mol. Mass.482.021
SMILESCN(CCCc1ccccc1Cl)c1nc(NCCc2ccc(O)cc2)nc(n1)N1CCNCC1