Reaction Details
TargetEstrogen receptor beta
LigandBDBM50121626
Substrate/Competitorn/a
Meas. Tech.ChEMBL_67203 (CHEMBL838887)
Ki 15±n/a nM
Citation Henke, BRConsler, TGGo, NHale, RLHohman, DRJones, SALu, ATMoore, LBMoore, JTOrband-Miller, LARobinett, RGShearin, JSpearing, PKStewart, ELTurnbull, PSWeaver, SLWilliams, SPWisely, GBLambert, MH A new series of estrogen receptor modulators that display selectivity for estrogen receptor beta. J Med Chem45:5492-505 (2002) Estrogen receptor beta
Name:Estrogen receptor beta
Type:Protein
Mol. Mass.:59238.43
Organism:Homo sapiens (Human)
Description:Q92731
Residue:530
BDBM50121626
NameBDBM50121626
Synonyms:4-(2-{4-[3-(4-Chloro-phenyl)-propylsulfanyl]-6-piperazin-1-yl-[1,3,5]triazin-2-ylamino}-ethyl)-phenol CHEMBL346455
TypeSmall organic molecule
Emp. Form.C24H29ClN6OS
Mol. Mass.485.045
SMILESOc1ccc(CCNc2nc(SCCCc3ccc(Cl)cc3)nc(n2)N2CCNCC2)cc1