Reaction Details
TargetN-formyl peptide receptor 2
LigandBDBM50559810
Substrate/Competitorn/a
Meas. Tech.ChEMBL_2070440 (CHEMBL4725974)
EC50 0.180±n/a nM
Citation Asahina, YWurtz, NRArakawa, KCarson, NFujii, KFukuchi, KGarcia, RHsu, MYIshiyama, JIto, BKick, ELupisella, JMatsushima, SOhata, KOstrowski, JSaito, YTsuda, KVillarreal, FYamada, HYamaoka, TWexler, RGordon, DKohno, Y Discovery of BMS-986235/LAR-1219: A Potent Formyl Peptide Receptor 2 (FPR2) Selective Agonist for the Prevention of Heart Failure. J Med Chem63:9003-9019 (2020) 
 
N-formyl peptide receptor 2
Name:N-formyl peptide receptor 2
Type:G Protein-Coupled Receptor (GPCR)
Mol. Mass.:38968.35
Organism:Homo sapiens (Human)
Description:P25090
Residue:351
BDBM50559810
NameBDBM50559810
Synonyms:CHEMBL4744094
TypeSmall organic molecule
Emp. Form.C18H18ClN3O3
Mol. Mass.359.807
SMILESCOc1ccc(cc1)[C@@H]1CNC(=O)[C@H]1NC(=O)Nc1ccc(Cl)cc1