Reaction Details
TargetN-formyl peptide receptor 2
LigandBDBM50559842
Substrate/Competitorn/a
Meas. Tech.ChEMBL_2070440 (CHEMBL4725974)
EC50 0.320000±n/a nM
Citation Asahina, YWurtz, NRArakawa, KCarson, NFujii, KFukuchi, KGarcia, RHsu, MYIshiyama, JIto, BKick, ELupisella, JMatsushima, SOhata, KOstrowski, JSaito, YTsuda, KVillarreal, FYamada, HYamaoka, TWexler, RGordon, DKohno, Y Discovery of BMS-986235/LAR-1219: A Potent Formyl Peptide Receptor 2 (FPR2) Selective Agonist for the Prevention of Heart Failure. J Med Chem63:9003-9019 (2020) 
 
N-formyl peptide receptor 2
Name:N-formyl peptide receptor 2
Type:G Protein-Coupled Receptor (GPCR)
Mol. Mass.:38968.35
Organism:Homo sapiens (Human)
Description:P25090
Residue:351
BDBM50559842
NameBDBM50559842
Synonyms:CHEMBL4778725
TypeSmall organic molecule
Emp. Form.C16H16F2N4O3S
Mol. Mass.382.385
SMILESCOc1cc(F)c([C@@H]2CNC(=O)[C@H]2NC(=O)Nc2cc(C)ns2)c(F)c1