Reaction Details
TargetMitogen-activated protein kinase 14
LigandBDBM50122402
Substrate/Competitorn/a
Meas. Tech.ChEBML_124486
IC50 11±n/a nM
Citation Stelmach, JELiu, LPatel, SBPivnichny, JVScapin, GSingh, SHop, CEWang, ZStrauss, JRCameron, PMNichols, EAO'Keefe, SJO'Neill, EASchmatz, DMSchwartz, CDThompson, CMZaller, DMDoherty, JB Design and synthesis of potent, orally bioavailable dihydroquinazolinone inhibitors of p38 MAP kinase. Bioorg Med Chem Lett13:277-80 (2002) Mitogen-activated protein kinase 14
Name:Mitogen-activated protein kinase 14
Type:Serine/threonine-protein kinase
Mol. Mass.:41286.76
Organism:Homo sapiens (Human)
Description:Q16539
Residue:360
BDBM50122402
NameBDBM50122402
Synonyms:1-(2,6-Dichloro-phenyl)-5-(2,4-difluoro-phenyl)-7-methoxy-3,4-dihydro-1H-quinazolin-2-one CHEMBL96091
TypeSmall organic molecule
Emp. Form.C21H14Cl2F2N2O2
Mol. Mass.435.251
SMILESCOc1cc2N(C(=O)NCc2c(c1)-c1ccc(F)cc1F)c1c(Cl)cccc1Cl