Reaction Details
TargetMitogen-activated protein kinase 14
LigandBDBM50122405
Substrate/Competitorn/a
Meas. Tech.ChEBML_124486
IC50 0.500000±n/a nM
Citation Stelmach, JELiu, LPatel, SBPivnichny, JVScapin, GSingh, SHop, CEWang, ZStrauss, JRCameron, PMNichols, EAO'Keefe, SJO'Neill, EASchmatz, DMSchwartz, CDThompson, CMZaller, DMDoherty, JB Design and synthesis of potent, orally bioavailable dihydroquinazolinone inhibitors of p38 MAP kinase. Bioorg Med Chem Lett13:277-80 (2002) Mitogen-activated protein kinase 14
Name:Mitogen-activated protein kinase 14
Type:Serine/threonine-protein kinase
Mol. Mass.:41286.76
Organism:Homo sapiens (Human)
Description:Q16539
Residue:360
BDBM50122405
NameBDBM50122405
Synonyms:5-(2-Chloro-4-fluoro-phenyl)-1-(2,6-dichloro-phenyl)-7-(1-methyl-piperidin-4-yl)-3,4-dihydro-1H-quinazolin-2-one CHEMBL96653
TypeSmall organic molecule
Emp. Form.C26H23Cl3FN3O
Mol. Mass.518.838
SMILESCN1CCC(CC1)c1cc2N(C(=O)NCc2c(c1)-c1ccc(F)cc1Cl)c1c(Cl)cccc1Cl