Reaction Details
TargetMitogen-activated protein kinase 14
LigandBDBM50122400
Substrate/Competitorn/a
Meas. Tech.ChEBML_124486
IC50 1.1±n/a nM
Citation Stelmach, JELiu, LPatel, SBPivnichny, JVScapin, GSingh, SHop, CEWang, ZStrauss, JRCameron, PMNichols, EAO'Keefe, SJO'Neill, EASchmatz, DMSchwartz, CDThompson, CMZaller, DMDoherty, JB Design and synthesis of potent, orally bioavailable dihydroquinazolinone inhibitors of p38 MAP kinase. Bioorg Med Chem Lett13:277-80 (2002) Mitogen-activated protein kinase 14
Name:Mitogen-activated protein kinase 14
Type:Serine/threonine-protein kinase
Mol. Mass.:41286.76
Organism:Homo sapiens (Human)
Description:Q16539
Residue:360
BDBM50122400
NameBDBM50122400
Synonyms:5-(2-Chloro-4-fluoro-phenyl)-7-(1-cyclopropyl-piperidin-4-yl)-1-(2,6-dichloro-phenyl)-3,4-dihydro-1H-quinazolin-2-one CHEMBL96565
TypeSmall organic molecule
Emp. Form.C28H25Cl3FN3O
Mol. Mass.544.875
SMILESFc1ccc(c(Cl)c1)-c1cc(cc2N(C(=O)NCc12)c1c(Cl)cccc1Cl)C1CCN(CC1)C1CC1