Reaction Details
TargetBromodomain-containing protein 3
LigandBDBM50560174
Substrate/Competitorn/a
Meas. Tech.ChEMBL_2071518 (CHEMBL4727052)
Kd 16±n/a nM
Citation Watson, RJBamborough, PBarnett, HChung, CWDavis, RGordon, LGrandi, PPetretich, MPhillipou, APrinjha, RKRioja, ISoden, PWerner, TDemont, EH GSK789: A Selective Inhibitor of the First Bromodomains (BD1) of the Bromo and Extra Terminal Domain (BET) Proteins. J Med Chem63:9045-9069 (2020) 
 
Bromodomain-containing protein 3
Name:Bromodomain-containing protein 3
Type:Protein
Mol. Mass.:79571.81
Organism:Homo sapiens (Human)
Description:Q15059
Residue:726
BDBM50560174
NameBDBM50560174
Synonyms:GSK789
TypeSmall organic molecule
Emp. Form.C26H33N5O3
Mol. Mass.463.5719
SMILESCN1CC[C@@H](Nc2ncc(-c3ccco3)c3cc(C)c(=O)[nH]c23)[C@@H](C1)C(=O)NC1CCCCC1