Reaction Details
TargetAcetylcholinesterase
LigandBDBM50560224
Substrate/Competitorn/a
Meas. Tech.ChEMBL_2071586 (CHEMBL4727120)
Ki 0.132±n/a nM
Citation Pérez-Areales, FJGarrido, MAso, EBartolini, MDe Simone, AEspargaró, AGinex, TSabate, RPérez, BAndrisano, VPuigoriol-Illamola, DPallàs, MLuque, FJLoza, MIBrea, JFerrer, ICiruela, FMesseguer, AMuñoz-Torrero, D Centrally Active Multitarget Anti-Alzheimer Agents Derived from the Antioxidant Lead CR-6. J Med Chem63:9360-9390 (2020) 
 
Acetylcholinesterase
Name:Acetylcholinesterase
Type:Enzyme
Mol. Mass.:67792.70
Organism:Homo sapiens (Human)
Description:P22303
Residue:614
BDBM50560224
NameBDBM50560224
Synonyms:CHEMBL4751100
TypeSmall organic molecule
Emp. Form.C34H46ClN3O3
Mol. Mass.580.2
SMILESCOc1cc2OC(C)(CCNCCCCCCCCNc3c4CCCCc4nc4cc(Cl)ccc34)CCc2cc1O