Reaction Details
TargetMitogen-activated protein kinase kinase kinase 5
LigandBDBM50212270
Substrate/Competitorn/a
Meas. Tech.ChEMBL_2072009 (CHEMBL4727543)
IC50 14±n/a nM
Citation Bigi-Botterill, SVIvetac, ABradshaw, ELCole, DDougan, DRErmolieff, JHalkowycz, PJohnson, BMcBride, CPickens, JSabat, MSwann, S Structure-guided optimization of a novel class of ASK1 inhibitors with increased sp Bioorg Med Chem Lett30:0 (2020) 
 
Mitogen-activated protein kinase kinase kinase 5
Name:Mitogen-activated protein kinase kinase kinase 5
Type:Protein
Mol. Mass.:154514.93
Organism:Homo sapiens (Human)
Description:Q99683
Residue:1374
BDBM50212270
NameBDBM50212270
Synonyms:CHEMBL3952214
TypeSmall organic molecule
Emp. Form.C18H17N5O
Mol. Mass.319.3605
SMILESCC(C)n1cnnc1-c1cccc(n1)N1Cc2ccccc2C1=O