Reaction Details
TargetGenome polyprotein
LigandBDBM50122883
Substrate/Competitorn/a
Meas. Tech.ChEMBL_143497 (CHEMBL754510)
Ki 4000±n/a nM
Citation Colarusso, SKoch, UGerlach, BSteinkühler, CDe Francesco, RAltamura, SMatassa, VGNarjes, F Phenethyl amides as novel noncovalent inhibitors of hepatitis C virus NS3/4A protease: discovery, initial SAR, and molecular modeling. J Med Chem46:345-8 (2003) 
 
Genome polyprotein
Name:Genome polyprotein
Type:Protein
Mol. Mass.:67067.41
Organism:Hepatitis C virus
Description:A3EZI9
Residue:631
BDBM50122883
NameBDBM50122883
Synonyms:3-Chloro-4-(2-{4,4-difluoro-2-[2-(2-isobutoxycarbonylamino-3-methyl-butyrylamino)-4-methyl-pentanoylamino]-butyrylamino}-ethyl)-benzoic acid | CHEMBL117241
TypeSmall organic molecule
Emp. Form.C29H43ClF2N4O7
Mol. Mass.633.124
SMILESCC(C)COC(=O)NC(C(C)C)C(=O)N[C@@H](CC(C)C)C(=O)NC(CC(F)F)C(=O)NCCc1ccc(cc1Cl)C(O)=O