Reaction Details
TargetMitogen-activated protein kinase 11
LigandBDBM50122908
Substrate/Competitorn/a
Meas. Tech.ChEMBL_124648 (CHEMBL731909)
IC50 94±n/a nM
Citation Colletti, SLFrie, JLDixon, ECSingh, SBChoi, BKScapin, GFitzgerald, CEKumar, SNichols, EAO'Keefe, SJO'Neill, EAPorter, GSamuel, KSchmatz, DMSchwartz, CDShoop, WLThompson, CMThompson, JEWang, RWoods, AZaller, DMDoherty, JB Hybrid-designed inhibitors of p38 MAP kinase utilizing N-arylpyridazinones. J Med Chem46:349-52 (2003) 
 
Mitogen-activated protein kinase 11
Name:Mitogen-activated protein kinase 11
Type:Enzyme
Mol. Mass.:41390.66
Organism:Mus musculus (mouse)
Description:Q9WUI1
Residue:364
BDBM50122908
NameBDBM50122908
Synonyms:6-[2-(2-Chloro-4-fluoro-phenyl)-imidazo[1,2-a]pyridin-3-yl]-2-o-tolyl-4,5-dihydro-2H-pyridazin-3-one | CHEMBL118466
TypeSmall organic molecule
Emp. Form.C24H18ClFN4O
Mol. Mass.432.877
SMILESCc1ccccc1N1N=C(CCC1=O)c1c(nc2ccccn12)-c1ccc(F)cc1Cl