Reaction Details
TargetMitogen-activated protein kinase 11
LigandBDBM50122913
Substrate/Competitorn/a
Meas. Tech.ChEMBL_124648 (CHEMBL731909)
IC50 140±n/a nM
Citation Colletti, SLFrie, JLDixon, ECSingh, SBChoi, BKScapin, GFitzgerald, CEKumar, SNichols, EAO'Keefe, SJO'Neill, EAPorter, GSamuel, KSchmatz, DMSchwartz, CDShoop, WLThompson, CMThompson, JEWang, RWoods, AZaller, DMDoherty, JB Hybrid-designed inhibitors of p38 MAP kinase utilizing N-arylpyridazinones. J Med Chem46:349-52 (2003) 
 
Mitogen-activated protein kinase 11
Name:Mitogen-activated protein kinase 11
Type:Enzyme
Mol. Mass.:41390.66
Organism:Mus musculus (mouse)
Description:Q9WUI1
Residue:364
BDBM50122913
NameBDBM50122913
Synonyms:6-[2-(2,4-Difluoro-phenyl)-imidazo[1,2-a]pyridin-3-yl]-2-o-tolyl-2H-pyridazin-3-one | CHEMBL118187
TypeSmall organic molecule
Emp. Form.C24H16F2N4O
Mol. Mass.414.4068
SMILESCc1ccccc1-n1nc(ccc1=O)-c1c(nc2ccccn12)-c1ccc(F)cc1F