Reaction Details
TargetThyroid hormone receptor beta
LigandBDBM50123061
Substrate/Competitorn/a
Meas. Tech.ChEBML_210497
Ki 0.310000±n/a nM
Citation Dow, RLSchneider, SRPaight, ESHank, RFChiang, PCornelius, PLee, ENewsome, WPSwick, AGSpitzer, JHargrove, DMPatterson, TAPandit, JChrunyk, BALeMotte, PKDanley, DERosner, MHAmmirati, MJSimons, SPSchulte, GKTate, BFDaSilva-Jardine, P Discovery of a novel series of 6-azauracil-based thyroid hormone receptor ligands: potent, TR beta subtype-selective thyromimetics. Bioorg Med Chem Lett13:379-82 (2003) Thyroid hormone receptor beta
Name:Thyroid hormone receptor beta
Type:Receptor
Mol. Mass.:52793.62
Organism:Homo sapiens (Human)
Description:Recombinant hThR was obtained from nuclear extracts from SF9 cells infected with baculovirus vectors encoding for ThRbeta 1.
Residue:461
BDBM50123061
NameBDBM50123061
Synonyms:2-[4-(3-{8-azaspiro[bicyclo[3.2.1]octane-3,2'-[1,3]dioxolane]-8-ylsulfonyl}-4-hydroxyphenoxy)-3,5-dichlorophenyl]-2,3,4,5-tetrahydro-1,2,4-triazine-3,5-dione CHEMBL125317
TypeSmall organic molecule
Emp. Form.C24H22Cl2N4O8S
Mol. Mass.597.424
SMILESOc1ccc(Oc2c(Cl)cc(cc2Cl)-n2ncc(=O)[nH]c2=O)cc1S(=O)(=O)N1C2CCC1CC1(C2)OCCO1