Reaction Details
TargetThyroid hormone receptor beta
LigandBDBM50123059
Substrate/Competitorn/a
Meas. Tech.ChEBML_210497
Ki 0.370±n/a nM
Citation Dow, RLSchneider, SRPaight, ESHank, RFChiang, PCornelius, PLee, ENewsome, WPSwick, AGSpitzer, JHargrove, DMPatterson, TAPandit, JChrunyk, BALeMotte, PKDanley, DERosner, MHAmmirati, MJSimons, SPSchulte, GKTate, BFDaSilva-Jardine, P Discovery of a novel series of 6-azauracil-based thyroid hormone receptor ligands: potent, TR beta subtype-selective thyromimetics. Bioorg Med Chem Lett13:379-82 (2003) Thyroid hormone receptor beta
Name:Thyroid hormone receptor beta
Type:Receptor
Mol. Mass.:52793.62
Organism:Homo sapiens (Human)
Description:Recombinant hThR was obtained from nuclear extracts from SF9 cells infected with baculovirus vectors encoding for ThRbeta 1.
Residue:461
BDBM50123059
NameBDBM50123059
Synonyms:2-{4-[3-(2-Aza-bicyclo[2.2.1]heptane-2-carbonyl)-4-hydroxy-phenoxy]-3,5-dichloro-phenyl}-2H-[1,2,4]triazine-3,5-dione | CHEMBL338602
TypeSmall organic molecule
Emp. Form.C22H18Cl2N4O5
Mol. Mass.489.308
SMILESOc1ccc(Oc2c(Cl)cc(cc2Cl)-n2ncc(=O)[nH]c2=O)cc1C(=O)N1CC2CCC1C2