Reaction Details
TargetThyroid hormone receptor beta
LigandBDBM50123063
Substrate/Competitorn/a
Meas. Tech.ChEBML_210497
Ki 0.230000±n/a nM
Citation Dow, RLSchneider, SRPaight, ESHank, RFChiang, PCornelius, PLee, ENewsome, WPSwick, AGSpitzer, JHargrove, DMPatterson, TAPandit, JChrunyk, BALeMotte, PKDanley, DERosner, MHAmmirati, MJSimons, SPSchulte, GKTate, BFDaSilva-Jardine, P Discovery of a novel series of 6-azauracil-based thyroid hormone receptor ligands: potent, TR beta subtype-selective thyromimetics. Bioorg Med Chem Lett13:379-82 (2003) Thyroid hormone receptor beta
Name:Thyroid hormone receptor beta
Type:Receptor
Mol. Mass.:52793.62
Organism:Homo sapiens (Human)
Description:Recombinant hThR was obtained from nuclear extracts from SF9 cells infected with baculovirus vectors encoding for ThRbeta 1.
Residue:461
BDBM50123063
NameBDBM50123063
Synonyms:2-{3,5-Dichloro-4-[4-hydroxy-3-(indole-1-sulfonyl)-phenoxy]-phenyl}-2H-[1,2,4]triazine-3,5-dione | CHEMBL123920
TypeSmall organic molecule
Emp. Form.C23H14Cl2N4O6S
Mol. Mass.545.351
SMILESOc1ccc(Oc2c(Cl)cc(cc2Cl)-n2ncc(=O)[nH]c2=O)cc1S(=O)(=O)n1ccc2ccccc12